{"text_format":"1","workbook":"xlsx","n_sheets":4,"sheets":["Rating from tested data","Full Octave","Generalized Example one test pt","Loudness Index Table"],"not_rendered":{"charts":4,"images":1,"macros":1,"external_links":3,"defined_names":32,"comments":0,"pivot_tables":0},"unopened":[],"bounds":{"document_bytes":16777216,"sheet_cells":100000,"rows_first":2000,"rows_last":500,"rows_between":2000,"halvings":0,"cell_chars":16384,"cell_head_chars":4096},"cells_cut":0,"cells_raw":0,"read":"whole","date_system":"1900"}

{"sheet":"Rating from tested data","index":0,"n_rows":53,"n_cols":13,"rows_kept":53,"cut":false,"hidden":false,"merged":[[49,1,49,8],[14,3,14,4],[20,9,20,12],[48,1,48,8],[21,1,21,8],[3,2,3,3],[4,2,4,3],[5,2,5,3],[12,3,12,4],[13,3,13,4]]}
[]
["Product Information"]
[]
["Company Name:",null,"ABC Company"]
["Trade Name:",null,"Model ABC"]
["Model Number:",null,"ABC 101"]
["Impeller Diameter:",null,18.25,"in"]
["Number of Blades:",null,7]
[]
[]
["Options"]
[]
["Sone Type:",null,null,"Hemispherical"]
["Data Format:",null,null,"Full Octave"]
["Sound Power Spectrum:",null,null,"Generalized"]
[]
["Test Data"]
[]
["Test Number:",null,null,12345,"S1"]
[]
[null,null,null,null,null,null,null,null,null,"Points of Operation"]
[null,"Full Octave Sound Power Results (dB)",null,null,null,null,null,null,null,"Speed","Static Pressure","Total Pressure","Fan Airflow"]
["Octave Band",1,2,3,4,5,6,7,8,"N","PS","PT","Q"]
["Center Frequency, f (Hz)",63,125,250,500,1000,2000,4000,8000,"rpm","in wg","in wg","cfm"]
[1,78.400000000000006,79.099999999999994,86,82.7,80.3,79.099999999999994,74.599999999999994,67.2,2000,0]
[2,75.099999999999994,79.2,83.6,78.7,76.2,74.7,69.599999999999994,62.4,2000,1.56]
[3,78.5,80.900000000000006,81.7,75.400000000000006,72.8,72.5,68.2,63.5,2000,2.4700000000000002]
[4,78.900000000000006,80.900000000000006,81.7,75,72,71.5,67.2,62.9,2000,2.63]
[null,80.2,81.400000000000006,82.4,75.8,72.400000000000006,71.099999999999994,66.900000000000006,63.4,2000,2.75]
[]
[]
[]
[]
["Published Sound Performance Ratings"]
[]
[]
["Company Name:",null,"ABC Company"]
["Trade Name:",null,"Model ABC"]
["Model Number:",null,"ABC 101"]
["Impeller Diameter:",null,18.25,"in"]
{"$rows_left_out":14}
{"sheet":"Full Octave","index":1,"n_rows":127,"n_cols":16,"rows_kept":127,"cut":false,"hidden":true,"merged":[[10,2,10,9],[18,2,18,9],[17,12,17,15],[38,1,43,1],[34,11,37,11],[34,14,37,14],[34,13,37,13],[34,12,37,12]]}
["AMCA Standard 301 Worksheet"]
[{"$f":"'Rating from tested data'!D15 &\" Sound Power Level Method\"","v":"Generalized Sound Power Level Method"}]
[]
["Comparison Data"]
[]
[null,"Company:",{"$f":"IF(ISTEXT('Rating from tested data'!C37),'Rating from tested data'!C37,\"\")","v":"ABC Company"}]
[null,"Model:",{"$f":"IF(ISTEXT('Rating from tested data'!C39),'Rating from tested data'!C39,\"\")","v":"ABC 101"}]
[null,"Comparison ID:",{"$f":"IF(ISTEXT('Rating from tested data'!#REF!),'Rating from tested data'!#REF!,\"\")","v":""}]
[null,"Impeller Diameter (Dc):",null,{"$f":"IF('Rating from tested data'!D40=\"mm\", 'Rating from tested data'!C40/25.4, 'Rating from tested data'!C40)","v":18.25},"inch"]
[]
[null,null,"Sound Power Levels (dB)",null,null,null,null,null,null,null,null,null,"Speed","Static Pressure"]
[null,"Octave Band",1,2,3,4,5,6,7,8,null,null,"N","Ps"]
[null,"Center Freq., f (Hz)",63,125,250,500,1000,2000,4000,8000,"LWA (dB)","Loudness (sones)","rpm",{"$f":"'Rating from tested data'!D47","v":"in wg"}]
[null,"Catalog Point",null,null,null,null,null,null,null,null,null,null,{"$f":"IF(ISNUMBER('Rating from tested data'!C46),'Rating from tested data'!C46,\"-\")","v":2500},{"$f":"IF(ISNUMBER('Rating from tested data'!C47),'Rating from tested data'!C47,\"-\")","v":2}]
[]
["Change the comparison data to IP unit"]
[]
[null,null,null,null,null,null,null,null,null,null,null,null,"Points of Operation"]
[null,null,"Sound Power Levels (dB)",null,null,null,null,null,null,null,null,null,"Speed","Static Pressure","Total Pressure","Fan Airflow"]
[null,"Octave Band",1,2,3,4,5,6,7,8,null,null,"N","Ps","PT","Q"]
[null,"Center Freq., f (Hz)",63,125,250,500,1000,2000,4000,8000,"LWA (dB)","Loudness (sones)","rpm","in wg.","in wg.","cfm"]
[null,"Comparison Data",null,null,null,null,null,null,null,null,null,null,{"$f":"M14","v":2500},{"$f":"IF((ISNUMBER(N14)), (IF(N13=\"mm Aq\", N14/25.4,IF(N13=\"mm Hg\", N14*0.535, (IF(N13=\"Pa\", N14*0.00401, N14))))),\"-\")","v":2}]
[]
[]
["Base Test Conditions and Results"]
[]
[null,"Test Number:",null,{"$f":"IF(ISTEXT('Rating from tested data'!D19),'Rating from tested data'!D19,\"\")","v":""}]
[null,"Model:",null,{"$f":"IF(ISTEXT('Rating from tested data'!C6),'Rating from tested data'!C6,\"\")","v":"ABC 101"}]
[null,"Speed:",null,{"$f":"AVERAGE('Rating from tested data'!J25:J30)","v":2000},"rpm"]
[null,"Impeller Diameter (D):",null,{"$f":"IF('Rating from tested data'!D7=\"mm\",'Rating from tested data'!C7/25.4, 'Rating from tested data'!C7)","v":18.25},"in"]
[null,"Number of Blades (NB):",null,{"$f":"'Rating from tested data'!C8","v":7}]
[null,"Blade pass frequency (fbp)",null,{"$f":"D29*D31/60","v":233.33333333333334},"Hz"]
[]
[null,null,"Sound Power Results, Lwm (dB)",null,null,null,null,null,null,null,null,"Speed","Static Pressure","Total Pressure","Fan Airflow"]
[null,null,"Octave Band",1,2,3,4,5,6,7,8,"N (rpm)","Ps (in. wg)","PT (in. wg)","Q (cfm)"]
[null,null,"Center Freq., fc (Hz)",63,125,250,500,1000,2000,4000,8000]
[null,null,"Lower frequency (Hz)",45,90,180,355,710,1400,2800,5600]
[null,null,"Upper frequency (Hz)",90,180,355,710,1400,2800,5600,11200]
[null,"Determination #",1,{"$f":"IF(NOT(ISBLANK('Rating from tested data'!B25)),'Rating from tested data'!B25,\"-\")","v":78.400000000000006},{"$f":"IF(NOT(ISBLANK('Rating from tested data'!C25)),'Rating from tested data'!C25,\"-\")","v":79.099999999999994},{"$f":"IF(NOT(ISBLANK('Rating from tested data'!D25)),'Rating from tested data'!D25,\"-\")","v":86},{"$f":"IF(NOT(ISBLANK('Rating from tested data'!E25)),'Rating from tested data'!E25,\"-\")","v":82.7},{"$f":"IF(NOT(ISBLANK('Rating from tested data'!F25)),'Rating from tested data'!F25,\"-\")","v":80.3},{"$f":"IF(NOT(ISBLANK('Rating from tested data'!G25)),'Rating from tested data'!G25,\"-\")","v":79.099999999999994},{"$f":"IF(NOT(ISBLANK('Rating from tested data'!H25)),'Rating from tested data'!H25,\"-\")","v":74.599999999999994},{"$f":"IF(NOT(ISBLANK('Rating from tested data'!I25)),'Rating from tested data'!I25,\"-\")","v":67.2},{"$f":"IF(ISNUMBER('Rating from tested data'!J25),'Rating from tested data'!J25,\"-\")","v":2000},{"$f":"IF(ISNUMBER('Rating from tested data'!K25), (IF('Rating from tested data'!$K$24=\"mm Aq\", ('Rating from tested data'!K25)/25.4, IF('Rating from tested data'!$K$24=\"mm Hg\", ('Rating from tested data'!K25)*0.535,(IF('Rating from tested data'!$K$24=\"Pa\", ('Rating from tested data'!K25)*0.00401, 'Rating from tested data'!K25))))),\"-\")","v":0},{"$f":"IF(ISNUMBER('Rating from tested data'!L25), (IF('Rating from tested data'!$L$24=\"mm Hg\", 'Rating from tested data'!L25/25.4,  IF('Rating from tested data'!$L$24=\"mm Hg\", 'Rating from tested data'!L25*0.535,IF('Rating from tested data'!$L$24=\"Pa\", 'Rating from tested data'!L25*0.00401, 'Rating from tested data'!L25)))),\"-\")","v":"-"},{"$f":"IF(ISNUMBER('Rating from tested data'!M25), (IF('Rating from tested data'!$M$24=\"m3/min\", 'Rating from tested data'!M25*35.31, (IF('Rating from tested data'!$M$24=\"m3/sec\", 'Rating from tested data'!M25*35.31*60, 'Rating from tested data'!M25)))),\"-\")","v":"-"}]
[null,null,2,{"$f":"IF(NOT(ISBLANK('Rating from tested data'!B26)),'Rating from tested data'!B26,\"-\")","v":75.099999999999994},{"$f":"IF(NOT(ISBLANK('Rating from tested data'!C26)),'Rating from tested data'!C26,\"-\")","v":79.2},{"$f":"IF(NOT(ISBLANK('Rating from tested data'!D26)),'Rating from tested data'!D26,\"-\")","v":83.6},{"$f":"IF(NOT(ISBLANK('Rating from tested data'!E26)),'Rating from tested data'!E26,\"-\")","v":78.7},{"$f":"IF(NOT(ISBLANK('Rating from tested data'!F26)),'Rating from tested data'!F26,\"-\")","v":76.2},{"$f":"IF(NOT(ISBLANK('Rating from tested data'!G26)),'Rating from tested data'!G26,\"-\")","v":74.7},{"$f":"IF(NOT(ISBLANK('Rating from tested data'!H26)),'Rating from tested data'!H26,\"-\")","v":69.599999999999994},{"$f":"IF(NOT(ISBLANK('Rating from tested data'!I26)),'Rating from tested data'!I26,\"-\")","v":62.4},{"$f":"IF(ISNUMBER('Rating from tested data'!J26),'Rating from tested data'!J26,\"-\")","v":2000},{"$f":"IF(ISNUMBER('Rating from tested data'!K26), (IF('Rating from tested data'!$K$24=\"mm Aq\", ('Rating from tested data'!K26)/25.4, IF('Rating from tested data'!$K$24=\"mm Hg\", ('Rating from tested data'!K26)*0.535,(IF('Rating from tested data'!$K$24=\"Pa\", ('Rating from tested data'!K26)*0.00401, 'Rating from tested data'!K26))))),\"-\")","v":1.56},{"$f":"IF(ISNUMBER('Rating from tested data'!L26), (IF('Rating from tested data'!$L$24=\"mm Hg\", 'Rating from tested data'!L26/25.4,  IF('Rating from tested data'!$L$24=\"mm Hg\", 'Rating from tested data'!L26*0.535,IF('Rating from tested data'!$L$24=\"Pa\", 'Rating from tested data'!L26*0.00401, 'Rating from tested data'!L26)))),\"-\")","v":"-"},{"$f":"IF(ISNUMBER('Rating from tested data'!M26), (IF('Rating from tested data'!$M$24=\"m3/min\", 'Rating from tested data'!M26*35.31, (IF('Rating from tested data'!$M$24=\"m3/sec\", 'Rating from tested data'!M26*35.31*60, 'Rating from tested data'!M26)))),\"-\")","v":"-"}]
{"$rows_left_out":88}
{"sheet":"Generalized Example one test pt","index":2,"n_rows":52,"n_cols":25,"rows_kept":52,"cut":false,"hidden":false,"merged":[[18,10,18,11],[18,13,18,14],[16,16,18,17],[4,2,4,3],[5,2,5,3],[6,2,6,3],[11,3,11,5],[12,3,12,5],[13,3,13,5]]}
[]
[]
["Product Information"]
[]
["Company Name:",null,"ABC Company"]
["Trade Name:",null,"Model ABC"]
["Model Number:",null,"ABC 101"]
[]
[]
["Options"]
[]
["Sone Type:",null,null,"Hemispherical"]
["Data Format:",null,null,"Full Octave"]
["Sound Power Spectrum:",null,null,"Generalized"]
[]
[]
[null,null,null,null,null,null,null,null,null,null,null,null,null,null,null,null,"Increase/decrease speed by 10 rpm"]
[null,"Generalized Sound Spectrum",null,null,null,null,null,null,null,"Example Converted Sound Spectrum"]
[null,null,"SI Units",null,null,null,"IP Units",null,null,null,"SI Units",null,null,"IP Units"]
[null,"Test Speed (N)",2000,"rpm",null,null,null,null,null,"Nc =",1980,"rpm"]
[null,"Impeller Diameter (D)",463.55,"mm",null,null,{"$f":"C21/25.4","v":18.25},"in.",null,"Dc = ",463.55,"mm",null,{"$f":"K21/25.4","v":18.25},"in."]
[null,"Airflow (Q)",4.47,"m3/s",null,null,{"$f":"C22*2119.7","v":9475.0589999999993},"cfm",null,"Qc = ",{"$f":"C22*(K20/C20)*(K21/C21)^3","v":4.4253},"m3/s",null,{"$f":"K22*2119.7","v":9380.3084099999996},"cfm"]
[null,"Total Pressure (Pt)",0,"Pa",null,null,{"$f":"C23/248.34","v":0},"in. wg",null,"Ptc = ",{"$f":"C23*(K20/C20)^2*(K21/C21)^2","v":0},"Pa",null,{"$f":"K23/248.34","v":0},"in. wg"]
[null,"Number of Blades (NB)",7,null,null,null,null,null,null,"NB = ",7]
[null,"Blade pass frequency (fbp)",{"$f":"C20*C24/60","v":233.33333333333334},"Hz",null,null,null,null,null,"fbpc = ",{"$f":"K20*K24/60","v":231},"Hz"]
[null,null,null,null,null,null,null,null,null,null,null,null,null,null,null,null,null,null,null,null,null,"AMCA  Band","Center Frequency","Upper Frequency","Lower Frequency"]
[null,"Band","Location of fbp","Hz","Test LW",null,"X","LWG",null,"Band","Hz","Location of fbp","Xc","Interpolated LWGc","BPF LWGc","Interpolation Index","LWGc","LWc",null,null,null,null,"f (Hz)","f (Hz)","f (Hz)"]
[null,null,null,null,null,"Extrapolated point:",0,{"$f":"H29","v":66.132199097805085}]
[null,1,{"$f":"IF(AND($C$25>X29,$C$25<=Y29),\"Yes\",\"No\")","v":"No"},63,78.400000000000006,null,{"$f":"10*LOG(D29/$C$20)+20","v":4.9831055378960052},{"$f":"E29-50*LOG($C$20/1000)-70*LOG($C$21/508)","v":66.132199097805085},null,1,63,{"$f":"IF(AND($K$25>=X29,$K$25<=Y29),\"Yes\",\"No\")","v":"No"},{"$f":"10*LOG(K29/$K$20)+20","v":5.0267535919205049},{"$f":"(M29-INDEX(G$28:G$37,$P29))/(INDEX(G$28:G$37,$P29+1)-INDEX(G$28:G$37,$P29))*(INDEX(H$28:H$37,$P29+1)-INDEX(H$28:H$37,$P29))+INDEX(H$28:H$37,$P29)","v":66.142466830741185},{"$f":"IF(L29=\"Yes\",$H$38,\"\")","v":""},{"$f":"MATCH(M29,G$28:G$37,1)","v":2},{"$f":"MAX(N29,O29)","v":66.142466830741185},{"$f":"Q29+50*LOG($K$20/1000)+70*LOG($K$21/508)","v":78.192027462813599},null,null,null,1,63,45,90]
[null,2,{"$f":"IF(AND($C$25>X30,$C$25<=Y30),\"Yes\",\"No\")","v":"No"},125,79.099999999999994,null,{"$f":"10*LOG(D30/$C$20)+20","v":7.9588001734407516},{"$f":"E30-50*LOG($C$20/1000)-70*LOG($C$21/508)","v":66.832199097805074},null,2,125,{"$f":"IF(AND($K$25>=X30,$K$25<=Y30),\"Yes\",\"No\")","v":"No"},8.0024482274652531,{"$f":"(M30-INDEX(G$28:G$37,$P30))/(INDEX(G$28:G$37,$P30+1)-INDEX(G$28:G$37,$P30))*(INDEX(H$28:H$37,$P30+1)-INDEX(H$28:H$37,$P30))+INDEX(H$28:H$37,$P30)","v":66.932246128701365},{"$f":"IF(L30=\"Yes\",$H$38,\"\")","v":""},{"$f":"MATCH(M30,G$28:G$37,1)","v":3},{"$f":"MAX(N30,O30)","v":66.932246128701365},{"$f":"Q30+50*LOG($K$20/1000)+70*LOG($K$21/508)","v":78.981806760773779},null,null,null,2,125,90,180]
[null,3,{"$f":"IF(AND($C$25>X31,$C$25<=Y31),\"Yes\",\"No\")","v":"Yes"},250,86,null,{"$f":"10*LOG(D31/$C$20)+20","v":10.969100130080564},{"$f":"E31-50*LOG($C$20/1000)-70*LOG($C$21/508)","v":73.732199097805079},null,3,250,"Yes",11.012748184105066,{"$f":"(M31-INDEX(G$28:G$37,$P31))/(INDEX(G$28:G$37,$P31+1)-INDEX(G$28:G$37,$P31))*(INDEX(H$28:H$37,$P31+1)-INDEX(H$28:H$37,$P31))+INDEX(H$28:H$37,$P31)","v":73.684350517811197},73.732199097805079,{"$f":"MATCH(M31,G$28:G$37,1)","v":4},{"$f":"MAX(N31,O31)","v":73.732199097805079},85.781759729877493,null,null,null,3,250,180,355]
[null,4,{"$f":"IF(AND($C$25>X32,$C$25<=Y32),\"Yes\",\"No\")","v":"No"},500,82.7,null,{"$f":"10*LOG(D32/$C$20)+20","v":13.979400086720375},{"$f":"E32-50*LOG($C$20/1000)-70*LOG($C$21/508)","v":70.432199097805082},null,4,500,"No",14.023048140744876,{"$f":"(M32-INDEX(G$28:G$37,$P32))/(INDEX(G$28:G$37,$P32+1)-INDEX(G$28:G$37,$P32))*(INDEX(H$28:H$37,$P32+1)-INDEX(H$28:H$37,$P32))+INDEX(H$28:H$37,$P32)","v":70.397400130536809},"",{"$f":"MATCH(M32,G$28:G$37,1)","v":5},{"$f":"MAX(N32,O32)","v":70.397400130536809},82.446960762609223,null,null,null,4,500,355,710]
[null,5,{"$f":"IF(AND($C$25>X33,$C$25<=Y33),\"Yes\",\"No\")","v":"No"},1000,80.3,null,{"$f":"10*LOG(D33/$C$20)+20","v":16.989700043360187},{"$f":"E33-50*LOG($C$20/1000)-70*LOG($C$21/508)","v":68.032199097805076},null,5,1000,"No",17.033348097384689,{"$f":"(M33-INDEX(G$28:G$37,$P33))/(INDEX(G$28:G$37,$P33+1)-INDEX(G$28:G$37,$P33))*(INDEX(H$28:H$37,$P33+1)-INDEX(H$28:H$37,$P33))+INDEX(H$28:H$37,$P33)","v":68.01479961417094},"",{"$f":"MATCH(M33,G$28:G$37,1)","v":6},{"$f":"MAX(N33,O33)","v":68.01479961417094},80.064360246243353,null,null,null,5,1000,710,1400]
[null,6,{"$f":"IF(AND($C$25>X34,$C$25<=Y34),\"Yes\",\"No\")","v":"No"},2000,79.099999999999994,null,{"$f":"10*LOG(D34/$C$20)+20","v":20},{"$f":"E34-50*LOG($C$20/1000)-70*LOG($C$21/508)","v":66.832199097805074},null,6,2000,"No",20.043648054024501,{"$f":"(M34-INDEX(G$28:G$37,$P34))/(INDEX(G$28:G$37,$P34+1)-INDEX(G$28:G$37,$P34))*(INDEX(H$28:H$37,$P34+1)-INDEX(H$28:H$37,$P34))+INDEX(H$28:H$37,$P34)","v":66.766951034177055},"",{"$f":"MATCH(M34,G$28:G$37,1)","v":7},{"$f":"MAX(N34,O34)","v":66.766951034177055},78.816511666249468,null,null,null,6,2000,1400,2800]
[null,7,{"$f":"IF(AND($C$25>X35,$C$25<=Y35),\"Yes\",\"No\")","v":"No"},4000,74.599999999999994,null,{"$f":"10*LOG(D35/$C$20)+20","v":23.010299956639813},{"$f":"E35-50*LOG($C$20/1000)-70*LOG($C$21/508)","v":62.332199097805074},null,7,4000,"No",23.053948010664314,{"$f":"(M35-INDEX(G$28:G$37,$P35))/(INDEX(G$28:G$37,$P35+1)-INDEX(G$28:G$37,$P35))*(INDEX(H$28:H$37,$P35+1)-INDEX(H$28:H$37,$P35))+INDEX(H$28:H$37,$P35)","v":62.224902282061223},"",{"$f":"MATCH(M35,G$28:G$37,1)","v":8},{"$f":"MAX(N35,O35)","v":62.224902282061223},74.274462914133636,null,null,null,7,4000,2800,5600]
[null,8,{"$f":"IF(AND($C$25>X36,$C$25<=Y36),\"Yes\",\"No\")","v":"No"},8000,67.2,null,{"$f":"10*LOG(D36/$C$20)+20","v":26.020599913279625},{"$f":"E36-50*LOG($C$20/1000)-70*LOG($C$21/508)","v":54.932199097805082},null,8,8000,"No",26.064247967304127,{"$f":"(M36-INDEX(G$28:G$37,$P36))/(INDEX(G$28:G$37,$P36+1)-INDEX(G$28:G$37,$P36))*(INDEX(H$28:H$37,$P36+1)-INDEX(H$28:H$37,$P36))+INDEX(H$28:H$37,$P36)","v":54.824902282061231},"",{"$f":"MATCH(M36,G$28:G$37,1)","v":9},{"$f":"MAX(N36,O36)","v":54.824902282061231},66.874462914133645,null,null,null,8,8000,5600,11200]
[null,null,null,null,null,"Extrapolated point:",40,{"$f":"(G37-G35)/(G36-G35)*(H36-H35)+H35","v":20.567663293472165}]
[null,null,null,null,null,{"$f":"\"+ Blade pass frequency:\"","v":"+ Blade pass frequency:"},{"$f":"INDEX(G28:G37,MATCH(\"Yes\",C28:C37,0))","v":10.969100130080564},{"$f":"INDEX(H28:H37,MATCH(\"Yes\",C28:C37,0))","v":73.732199097805079}]
[]
[]
{"$rows_left_out":13}
{"sheet":"Loudness Index Table","index":3,"n_rows":127,"n_cols":10,"rows_kept":127,"cut":false,"hidden":true,"merged":[]}
[]
[null,"Loudness Index Table"]
[]
[null,null,"Octave Band / Center Frequency (Hz)"]
[null,null,1,2,3,4,5,6,7,8]
[null,"Lp (dB)",63,125,250,500,1000,2000,4000,8000]
[null,0]
[null,1]
[null,2]
[null,3]
[null,4]
[null,5]
[null,6]
[null,7]
[null,8]
[null,9,null,null,null,null,null,null,null,0.1]
[null,10,null,null,null,null,null,null,null,0.14000000000000001]
[null,11,null,null,null,null,null,null,null,0.18]
[null,12,null,null,null,null,null,null,0.1,0.22]
[null,13,null,null,null,null,null,null,0.14000000000000001,0.26]
[null,14,null,null,null,null,null,null,0.18,0.3]
[null,15,null,null,null,null,null,0.1,0.22,0.35]
[null,16,null,null,null,null,null,0.14000000000000001,0.26,0.4]
[null,17,null,null,null,null,null,0.18,0.3,0.45]
[null,18,null,null,null,null,0.1,0.22,0.35,0.5]
[null,19,null,null,null,null,0.14000000000000001,0.26,0.4,0.55000000000000004]
[null,20,null,null,null,null,0.18,0.3,0.45,0.61]
[null,21,null,null,null,null,0.22,0.35,0.5,0.67]
[null,22,null,null,null,null,0.26,0.4,0.55000000000000004,0.73]
[null,23,null,null,null,0.12,0.3,0.45,0.61,0.8]
[null,24,null,null,null,0.16,0.35,0.5,0.67,0.87]
[null,25,null,null,null,0.21,0.4,0.55000000000000004,0.73,0.94]
[null,26,null,null,null,0.26,0.45,0.61,0.8,1.02]
[null,27,null,null,null,0.31,0.5,0.67,0.87,1.1000000000000001]
[null,28,null,null,null,0.37,0.55000000000000004,0.73,0.94,1.18]
[null,29,null,null,0.12,0.43,0.61,0.8,1.02,1.27]
[null,30,null,null,0.16,0.49,0.67,0.87,1.1000000000000001,1.35]
[null,31,null,null,0.21,0.55000000000000004,0.73,0.94,1.18,1.44]
[null,32,null,null,0.26,0.61,0.8,1.02,1.27,1.54]
[null,33,null,null,0.31,0.67,0.87,1.1000000000000001,1.35,1.64]
{"$rows_left_out":87}